01-26-2021, 03:25 PM
(01-25-2021, 05:17 PM)arno_nuehm Wrote:(01-19-2021, 04:16 PM)dukla2000 Wrote:(12-16-2020, 07:06 PM)arno_nuehm Wrote: ...
Axolotl 0.9.0.1 is now running with qmlscene on the latest fde-image (20201215). I updated the Mobian Wiki - Manual install.
...
I have just followed the steps under "Manual install" with no major problems (BTW npm install ran about 25 minutes) until
Code:mobian@duklapp:~/go/src/github.com/nanu-c/axolotl/axolotl-web$ npm run build > axolotl-web@0.1.0 build > vue-cli-service build ⠹ Building for production... ERROR Failed to compile with 3 errors 22:09:47 error in ./src/assets/dark.scss Module build failed (from ./node_modules/mini-css-extract-plugin/dist/loader.js): ModuleBuildError: Module build failed (from ./node_modules/sass-loader/dist/cjs.js): Error: Node Sass does not yet support your current environment: Linux Unsupported architecture (arm64) with Node.js 12.x For more information on which environments are supported please see: https://github.com/sass/node-sass/releases/tag/v4.14.1 at module.exports (/home/mobian/go/src/github.com/nanu-c/axolotl/axolotl-web/node_modules/node-sass/lib/binding.js:13:13) at Object.<anonymous> (/home/mobian/go/src/github.com/nanu-c/axolotl/axolotl-web/node_modules/node-sass/lib/index.js:14:35) at Module._compile (internal/modules/cjs/loader.js:999:30) at Object.Module._extensions..js (internal/modules/cjs/loader.js:1027:10) at Module.load (internal/modules/cjs/loader.js:863:32) at Function.Module._load (internal/modules/cjs/loader.js:708:14) at Module.require (internal/modules/cjs/loader.js:887:19) at require (internal/modules/cjs/helpers.js:74:18) at getDefaultSassImplementation (/home/mobian/go/src/github.com/nanu-c/axolotl/axolotl-web/node_modules/sass-loader/dist/getDefaultSassImplementation.js:24:10) at getSassImplementation (/home/mobian/go/src/github.com/nanu-c/axolotl/axolotl-web/node_modules/sass-loader/dist/getSassImplementation.js:19:72) at Object.loader (/home/mobian/go/src/github.com/nanu-c/axolotl/axolotl-web/node_modules/sass-loader/dist/index.js:40:61) at /home/mobian/go/src/github.com/nanu-c/axolotl/axolotl-web/node_modules/webpack/lib/NormalModule.js:316:20 at /home/mobian/go/src/github.com/nanu-c/axolotl/axolotl-web/node_modules/loader-runner/lib/LoaderRunner.js:367:11 at /home/mobian/go/src/github.com/nanu-c/axolotl/axolotl-web/node_modules/loader-runner/lib/LoaderRunner.js:233:18 at runSyncOrAsync (/home/mobian/go/src/github.com/nanu-c/axolotl/axolotl-web/node_modules/loader-runner/lib/LoaderRunner.js:143:3) at iterateNormalLoaders (/home/mobian/go/src/github.com/nanu-c/axolotl/axolotl-web/node_modules/loader-runner/lib/LoaderRunner.js:232:2) at Array.<anonymous> (/home/mobian/go/src/github.com/nanu-c/axolotl/axolotl-web/node_modules/loader-runner/lib/LoaderRunner.js:205:4) at Storage.finished (/home/mobian/go/src/github.com/nanu-c/axolotl/axolotl-web/node_modules/enhanced-resolve/lib/CachedInputFileSystem.js:55:16) at /home/mobian/go/src/github.com/nanu-c/axolotl/axolotl-web/node_modules/enhanced-resolve/lib/CachedInputFileSystem.js:91:9 at /home/mobian/go/src/github.com/nanu-c/axolotl/axolotl-web/node_modules/graceful-fs/graceful-fs.js:115:16 at FSReqCallback.readFileAfterClose [as oncomplete] (internal/fs/read_file_context.js:63:3) @ ./node_modules/cache-loader/dist/cjs.js??ref--12-0!./node_modules/thread-loader/dist/cjs.js!./node_modules/babel-loader/lib!./node_modules/cache-loader/dist/cjs.js??ref--0-0!./node_modules/vue-loader/lib??vue-loader-options!./src/App.vue?vue&type=script&lang=js& 33:2-30 @ ./src/App.vue?vue&type=script&lang=js& @ ./src/App.vue @ ./src/main.js @ multi ./src/main.js error in ./src/assets/light.scss Module build failed (from ./node_modules/mini-css-extract-plugin/dist/loader.js): ModuleBuildError: Module build failed (from ./node_modules/sass-loader/dist/cjs.js): Error: Node Sass does not yet support your current environment: Linux Unsupported architecture (arm64) with Node.js 12.x For more information on which environments are supported please see: https://github.com/sass/node-sass/releases/tag/v4.14.1 at module.exports (/home/mobian/go/src/github.com/nanu-c/axolotl/axolotl-web/node_modules/node-sass/lib/binding.js:13:13) at Object.<anonymous> (/home/mobian/go/src/github.com/nanu-c/axolotl/axolotl-web/node_modules/node-sass/lib/index.js:14:35) at Module._compile (internal/modules/cjs/loader.js:999:30) at Object.Module._extensions..js (internal/modules/cjs/loader.js:1027:10) at Module.load (internal/modules/cjs/loader.js:863:32) at Function.Module._load (internal/modules/cjs/loader.js:708:14) at Module.require (internal/modules/cjs/loader.js:887:19) at require (internal/modules/cjs/helpers.js:74:18) at getDefaultSassImplementation (/home/mobian/go/src/github.com/nanu-c/axolotl/axolotl-web/node_modules/sass-loader/dist/getDefaultSassImplementation.js:24:10) at getSassImplementation (/home/mobian/go/src/github.com/nanu-c/axolotl/axolotl-web/node_modules/sass-loader/dist/getSassImplementation.js:19:72) at Object.loader (/home/mobian/go/src/github.com/nanu-c/axolotl/axolotl-web/node_modules/sass-loader/dist/index.js:40:61) at /home/mobian/go/src/github.com/nanu-c/axolotl/axolotl-web/node_modules/webpack/lib/NormalModule.js:316:20 at /home/mobian/go/src/github.com/nanu-c/axolotl/axolotl-web/node_modules/loader-runner/lib/LoaderRunner.js:367:11 at /home/mobian/go/src/github.com/nanu-c/axolotl/axolotl-web/node_modules/loader-runner/lib/LoaderRunner.js:233:18 at runSyncOrAsync (/home/mobian/go/src/github.com/nanu-c/axolotl/axolotl-web/node_modules/loader-runner/lib/LoaderRunner.js:143:3) at iterateNormalLoaders (/home/mobian/go/src/github.com/nanu-c/axolotl/axolotl-web/node_modules/loader-runner/lib/LoaderRunner.js:232:2) at Array.<anonymous> (/home/mobian/go/src/github.com/nanu-c/axolotl/axolotl-web/node_modules/loader-runner/lib/LoaderRunner.js:205:4) at Storage.finished (/home/mobian/go/src/github.com/nanu-c/axolotl/axolotl-web/node_modules/enhanced-resolve/lib/CachedInputFileSystem.js:55:16) at /home/mobian/go/src/github.com/nanu-c/axolotl/axolotl-web/node_modules/enhanced-resolve/lib/CachedInputFileSystem.js:91:9 at /home/mobian/go/src/github.com/nanu-c/axolotl/axolotl-web/node_modules/graceful-fs/graceful-fs.js:115:16 at FSReqCallback.readFileAfterClose [as oncomplete] (internal/fs/read_file_context.js:63:3) @ ./node_modules/cache-loader/dist/cjs.js??ref--12-0!./node_modules/thread-loader/dist/cjs.js!./node_modules/babel-loader/lib!./node_modules/cache-loader/dist/cjs.js??ref--0-0!./node_modules/vue-loader/lib??vue-loader-options!./src/App.vue?vue&type=script&lang=js& 35:2-31 @ ./src/App.vue?vue&type=script&lang=js& @ ./src/App.vue @ ./src/main.js @ multi ./src/main.js error in ./src/components/Message.vue?vue&type=style&index=0&id=b1b7f866&lang=scss&scoped=true& Module build failed (from ./node_modules/mini-css-extract-plugin/dist/loader.js): ModuleBuildError: Module build failed (from ./node_modules/sass-loader/dist/cjs.js): Error: Node Sass does not yet support your current environment: Linux Unsupported architecture (arm64) with Node.js 12.x For more information on which environments are supported please see: https://github.com/sass/node-sass/releases/tag/v4.14.1 at module.exports (/home/mobian/go/src/github.com/nanu-c/axolotl/axolotl-web/node_modules/node-sass/lib/binding.js:13:13) at Object.<anonymous> (/home/mobian/go/src/github.com/nanu-c/axolotl/axolotl-web/node_modules/node-sass/lib/index.js:14:35) at Module._compile (internal/modules/cjs/loader.js:999:30) at Object.Module._extensions..js (internal/modules/cjs/loader.js:1027:10) at Module.load (internal/modules/cjs/loader.js:863:32) at Function.Module._load (internal/modules/cjs/loader.js:708:14) at Module.require (internal/modules/cjs/loader.js:887:19) at require (internal/modules/cjs/helpers.js:74:18) at getDefaultSassImplementation (/home/mobian/go/src/github.com/nanu-c/axolotl/axolotl-web/node_modules/sass-loader/dist/getDefaultSassImplementation.js:24:10) at getSassImplementation (/home/mobian/go/src/github.com/nanu-c/axolotl/axolotl-web/node_modules/sass-loader/dist/getSassImplementation.js:19:72) at Object.loader (/home/mobian/go/src/github.com/nanu-c/axolotl/axolotl-web/node_modules/sass-loader/dist/index.js:40:61) at /home/mobian/go/src/github.com/nanu-c/axolotl/axolotl-web/node_modules/webpack/lib/NormalModule.js:316:20 at /home/mobian/go/src/github.com/nanu-c/axolotl/axolotl-web/node_modules/loader-runner/lib/LoaderRunner.js:367:11 at /home/mobian/go/src/github.com/nanu-c/axolotl/axolotl-web/node_modules/loader-runner/lib/LoaderRunner.js:233:18 at runSyncOrAsync (/home/mobian/go/src/github.com/nanu-c/axolotl/axolotl-web/node_modules/loader-runner/lib/LoaderRunner.js:143:3) at iterateNormalLoaders (/home/mobian/go/src/github.com/nanu-c/axolotl/axolotl-web/node_modules/loader-runner/lib/LoaderRunner.js:232:2) at iterateNormalLoaders (/home/mobian/go/src/github.com/nanu-c/axolotl/axolotl-web/node_modules/loader-runner/lib/LoaderRunner.js:221:10) at /home/mobian/go/src/github.com/nanu-c/axolotl/axolotl-web/node_modules/loader-runner/lib/LoaderRunner.js:236:3 at context.callback (/home/mobian/go/src/github.com/nanu-c/axolotl/axolotl-web/node_modules/loader-runner/lib/LoaderRunner.js:111:13) at /home/mobian/go/src/github.com/nanu-c/axolotl/axolotl-web/node_modules/cache-loader/dist/index.js:147:7 at /home/mobian/go/src/github.com/nanu-c/axolotl/axolotl-web/node_modules/graceful-fs/graceful-fs.js:57:14 at FSReqCallback.oncomplete (fs.js:156:23) @ ./src/components/Message.vue?vue&type=style&index=0&id=b1b7f866&lang=scss&scoped=true& 1:0-532 1:548-551 1:553-1082 1:553-1082 @ ./src/components/Message.vue @ ./node_modules/cache-loader/dist/cjs.js??ref--12-0!./node_modules/thread-loader/dist/cjs.js!./node_modules/babel-loader/lib!./node_modules/cache-loader/dist/cjs.js??ref--0-0!./node_modules/vue-loader/lib??vue-loader-options!./src/pages/MessageList.vue?vue&type=script&lang=js& @ ./src/pages/MessageList.vue?vue&type=script&lang=js& @ ./src/pages/MessageList.vue @ ./src/router/router.js @ ./src/main.js @ multi ./src/main.js ERROR Build failed with errors. npm ERR! code 1 npm ERR! path /home/mobian/go/src/github.com/nanu-c/axolotl/axolotl-web npm ERR! command failed npm ERR! command sh -c vue-cli-service build npm ERR! A complete log of this run can be found in: npm ERR! /home/mobian/.npm/_logs/2021-01-19T22_09_48_338Z-debug.log mobian@duklapp:~/go/src/github.com/nanu-c/axolotl/axolotl-web$
I absolutely haven't a clue what I am doing - I am merely following the recipe, so any suggestions welcome!
TIA
Previous step seems to have been fine:
Code:mobian@duklapp:~/go/src/github.com/nanu-c/axolotl/axolotl-web$ npm install added 1753 packages, and audited 1820 packages in 25m 7 packages are looking for funding run `npm fund` for details 1 low severity vulnerability To address all issues, run: npm audit fix Run `npm audit` for details. mobian@duklapp:~/go/src/github.com/nanu-c/axolotl/axolotl-web$
Hello there,
I tested the manual install of Axolotl 0.9.4 with a fresh Mobian (FDE-Installer 20201215) and all the latest updates. And I got the same error message at
Code:npm run build
I will post an issue on github tomorrow; hopefully 0.9.5 fixes that. I'm still running 0.9.0.1 on my daily driver...
Cheers
Issue resolved.
The rebuild of node-sass didn't work the first time. The second time takes much longer but leads to a successful npm run build.

