ROCK64 Kernel compilation problem
#1
I had a problem compiling the rock64 kernel(https://github.com/rock64-linux?tab=repositories),
Buiding kernel and u-boot image: build/mk-kernel.sh rk3328-rock64(build/mk-uboot.sh rk3328-rock64) 
The current uboot partial compilation is OK。


 Building kernel for rk3328-rock64 board! 
 Using rockchip_linux_defconfig 
#
# configuration written to .config
#
scripts/kconfig/conf  --silentoldconfig Kconfig
  CHK     include/config/kernel.release
  CHK     include/generated/uapi/linux/version.h
  CHK     include/generated/utsrelease.h
  CHK     include/generated/timeconst.h
  CHK     include/generated/bounds.h
  CHK     include/generated/asm-offsets.h
  CALL    scripts/checksyscalls.sh
make[1]: 'include/generated/vdso-offsets.h' is up to date.
  CHK     include/generated/compile.h
  CC      arch/arm64/kernel/topology.o
  CC      block/elevator.o
  CC      crypto/ablk_helper.o
arch/arm64/kernel/topology.c: In function ‘parse_cluster’:
arch/arm64/kernel/topology.c:133:40: warning: ‘%d’ directive output may be truncated writing between 1 and 10 bytes into a region of size 3 [-Wformat-truncation=]
error, forbidden warning: topology.c:133
scripts/Makefile.build:258: recipe for target 'arch/arm64/kernel/topology.o' failed
make[1]: *** [arch/arm64/kernel/topology.o] Error 1
Makefile:983: recipe for target 'arch/arm64/kernel' failed
make: *** [arch/arm64/kernel] Error 2
make: *** Waiting for unfinished jobs....
  GZIP    kernel/config_data.gz
  CC      kernel/relay.o
crypto/ablk_helper.c: In function ‘ablk_init’:
crypto/ablk_helper.c:144:49: warning: ‘%s’ directive output may be truncated writing up to 63 bytes into a region of size 55 [-Wformat-truncation=]
error, forbidden warning: ablk_helper.c:144
scripts/Makefile.build:258: recipe for target 'crypto/ablk_helper.o' failed
make[1]: *** [crypto/ablk_helper.o] Error 1
Makefile:983: recipe for target 'crypto' failed
make: *** [crypto] Error 2
  CC      drivers/cpufreq/rockchip-cpufreq.o
block/elevator.c: In function ‘elv_register’:
block/elevator.c:839:14: warning: ‘snprintf’ output may be truncated before the last format character [-Wformat-truncation=]
error, forbidden warning: elevator.c:839
scripts/Makefile.build:258: recipe for target 'block/elevator.o' failed
make[1]: *** [block/elevator.o] Error 1
Makefile:983: recipe for target 'block' failed
make: *** [block] Error 2
kernel/relay.c: In function ‘relay_create_buf_file’:
kernel/relay.c:420:35: warning: ‘snprintf’ output may be truncated before the last format character [-Wformat-truncation=]
error, forbidden warning: relay.c:420
scripts/Makefile.build:258: recipe for target 'kernel/relay.o' failed
make[1]: *** [kernel/relay.o] Error 1
Makefile:983: recipe for target 'kernel' failed
make: *** [kernel] Error 2
^CTraceback (most recent call last):
  File "./scripts/gcc-wrapper.py", line 102, in <module>
    scripts/Makefile.build:403: recipe for target 'drivers/firmware' failed
scripts/Makefile.modbuiltin:54: recipe for target 'drivers/gpu/arm/mali400/ump' failed
  Reply


Possibly Related Threads…
Thread Author Replies Views Last Post
  slarm64 (unofficial slackware) Rock64 RK3328 (aarch64) mara 129 137,726 01-09-2023, 12:16 PM
Last Post: mara
  DietPi OS for ROCK64 MichaIng 41 19,842 12-07-2022, 08:22 PM
Last Post: luminosity7
  Using multiple UART's on Rock64. ramprasad 0 347 08-29-2022, 01:22 PM
Last Post: ramprasad
  Using multiple UART's on Rock64. sachineswar 0 318 08-29-2022, 12:31 PM
Last Post: sachineswar
  Rock64 v2 - did not work song / audio sqw200zu 1 507 07-29-2022, 12:08 PM
Last Post: sqw200zu
  Rock64 Rev3 doesn't boot and leds blinking fast dishins 6 5,527 06-30-2022, 06:28 PM
Last Post: rookie_267
  my rock64 can't boot rookie_267 0 507 06-27-2022, 06:52 PM
Last Post: rookie_267
  Armbian for Rock64 pineadmin 57 54,138 04-01-2022, 03:16 PM
Last Post: TRS-80
  Fedora 35 on rock64 dafsjr 4 2,148 03-19-2022, 10:03 PM
Last Post: t4_4t
  openwrt for the rock64 wilsonYan 29 19,052 03-13-2022, 10:25 PM
Last Post: CanadianBacon

Forum Jump:


Users browsing this thread: 1 Guest(s)